1 2 3 4 5 6 7 8 9 10 11 12 13 14 15 16 17 18 19 20 21 22 23 24 25 26 27 28 29 30 31 32 33 34 35 36 37 38 39 40 41 42 43 44 45 46 47 48 49 50 51 52 53 54 55 56 57 58 59 60 61 62 63 64 65 66 67 68 69 70 71 72 73 74 75 76 77 78 79 80 81 82 83 84 85
|
-- Copyright (C) 2001 Bill Billowitch.
-- Some of the work to develop this test suite was done with Air Force
-- support. The Air Force and Bill Billowitch assume no
-- responsibilities for this software.
-- This file is part of VESTs (Vhdl tESTs).
-- VESTs is free software; you can redistribute it and/or modify it
-- under the terms of the GNU General Public License as published by the
-- Free Software Foundation; either version 2 of the License, or (at
-- your option) any later version.
-- VESTs is distributed in the hope that it will be useful, but WITHOUT
-- ANY WARRANTY; without even the implied warranty of MERCHANTABILITY or
-- FITNESS FOR A PARTICULAR PURPOSE. See the GNU General Public License
-- for more details.
-- You should have received a copy of the GNU General Public License
-- along with VESTs; if not, write to the Free Software Foundation,
-- Inc., 59 Temple Place, Suite 330, Boston, MA 02111-1307 USA
-- ---------------------------------------------------------------------
--
-- $Id: tc3126.vhd,v 1.2 2001-10-26 16:29:51 paw Exp $
-- $Revision: 1.2 $
--
-- ---------------------------------------------------------------------
ENTITY c05s02b01x02p12n01i03126ent_a IS
generic ( g1 : integer := 3 );
END c05s02b01x02p12n01i03126ent_a;
ARCHITECTURE c05s02b01x02p12n01i03126arch_a OF c05s02b01x02p12n01i03126ent_a IS
BEGIN
TESTING: PROCESS
BEGIN
assert g1 /= 2 report "g1 = 2" severity FAILURE;
assert g1 /= 3 report "g1 = 3" severity FAILURE;
assert g1 = 4 report "g1 /= 4" severity FAILURE;
assert g1 /= 5 report "g1 = 5" severity FAILURE;
assert g1 /= 6 report "g1 = 6" severity FAILURE;
assert NOT( g1 /= 2 and
g1 /= 3 and
g1 = 4 and
g1 /= 5 and
g1 /= 6 )
report "***PASSED TEST: c05s02b01x02p12n01i03126"
severity NOTE;
assert ( g1 /= 2 and
g1 /= 3 and
g1 = 4 and
g1 /= 5 and
g1 /= 6 )
report "***FAILED TEST: c05s02b01x02p12n01i03126 - An actual associated with a formal generic in a generic map aspect be an expression test failed."
severity ERROR;
wait;
END PROCESS TESTING;
END c05s02b01x02p12n01i03126arch_a;
ENTITY c05s02b01x02p12n01i03126ent IS
END c05s02b01x02p12n01i03126ent;
ARCHITECTURE c05s02b01x02p12n01i03126arch OF c05s02b01x02p12n01i03126ent IS
component ic_socket
generic ( g1 : integer := 2 );
end component;
for instance : ic_socket use entity work.c05s02b01x02p12n01i03126ent_a (c05s02b01x02p12n01i03126arch_a)
generic map ( g1 => g1 + g1 );
BEGIN
instance : ic_socket ;
END c05s02b01x02p12n01i03126arch;
configuration c05s02b01x02p12n01i03126cfg of c05s02b01x02p12n01i03126ent is
for c05s02b01x02p12n01i03126arch
end for;
end c05s02b01x02p12n01i03126cfg;
|