File: test_smrawverify.sh

package info (click to toggle)
libsmraw 20160424-1
  • links: PTS, VCS
  • area: main
  • in suites: stretch
  • size: 12,252 kB
  • ctags: 5,029
  • sloc: ansic: 177,590; sh: 13,168; makefile: 1,311; python: 814; cpp: 561; sed: 134
file content (62 lines) | stat: -rwxr-xr-x 1,266 bytes parent folder | download
1
2
3
4
5
6
7
8
9
10
11
12
13
14
15
16
17
18
19
20
21
22
23
24
25
26
27
28
29
30
31
32
33
34
35
36
37
38
39
40
41
42
43
44
45
46
47
48
49
50
51
52
53
54
55
56
57
58
59
60
61
62
#!/bin/bash
# Verify tool testing script
#
# Version: 20160328

EXIT_SUCCESS=0;
EXIT_FAILURE=1;
EXIT_IGNORE=77;

TEST_PREFIX=`dirname ${PWD}`;
TEST_PREFIX=`basename ${TEST_PREFIX} | sed 's/^lib\([^-]*\).*$/\1/'`;
TEST_SUFFIX="verify";

TEST_PROFILE="${TEST_PREFIX}${TEST_SUFFIX}";
TEST_DESCRIPTION="${TEST_PREFIX}${TEST_SUFFIX}";
OPTION_SETS="";

TEST_TOOL_DIRECTORY="../${TEST_PREFIX}tools";
TEST_TOOL="${TEST_PREFIX}${TEST_SUFFIX}";
INPUT_DIRECTORY="input";
INPUT_GLOB="*";

if ! test -z ${SKIP_TOOLS_TESTS};
then
	exit ${EXIT_IGNORE};
fi

TEST_EXECUTABLE="${TEST_TOOL_DIRECTORY}/${TEST_TOOL}";

if ! test -x "${TEST_EXECUTABLE}";
then
	TEST_EXECUTABLE="${TEST_TOOL_DIRECTORY}/${TEST_TOOL}.exe";
fi

if ! test -x "${TEST_EXECUTABLE}";
then
	echo "Missing test executable: ${TEST_EXECUTABLE}";

	exit ${EXIT_FAILURE};
fi

TEST_RUNNER="tests/test_runner.sh";

if ! test -f "${TEST_RUNNER}";
then
	TEST_RUNNER="./test_runner.sh";
fi

if ! test -f "${TEST_RUNNER}";
then
	echo "Missing test runner: ${TEST_RUNNER}";

	exit ${EXIT_FAILURE};
fi

source ${TEST_RUNNER};

run_test_on_input_directory "${TEST_PROFILE}" "${TEST_DESCRIPTION}" "with_stdout_reference" "${OPTION_SETS}" "${TEST_EXECUTABLE}" "${INPUT_DIRECTORY}" "${INPUT_GLOB}" -q;
RESULT=$?;

exit ${RESULT};