File: config.log

package info (click to toggle)
qflow 1.3.17+dfsg.1-2
  • links: PTS, VCS
  • area: main
  • in suites: bullseye, sid
  • size: 3,852 kB
  • sloc: ansic: 8,342; csh: 3,873; sh: 2,869; makefile: 417; tcl: 6
file content (404 lines) | stat: -rw-r--r-- 13,003 bytes parent folder | download
1
2
3
4
5
6
7
8
9
10
11
12
13
14
15
16
17
18
19
20
21
22
23
24
25
26
27
28
29
30
31
32
33
34
35
36
37
38
39
40
41
42
43
44
45
46
47
48
49
50
51
52
53
54
55
56
57
58
59
60
61
62
63
64
65
66
67
68
69
70
71
72
73
74
75
76
77
78
79
80
81
82
83
84
85
86
87
88
89
90
91
92
93
94
95
96
97
98
99
100
101
102
103
104
105
106
107
108
109
110
111
112
113
114
115
116
117
118
119
120
121
122
123
124
125
126
127
128
129
130
131
132
133
134
135
136
137
138
139
140
141
142
143
144
145
146
147
148
149
150
151
152
153
154
155
156
157
158
159
160
161
162
163
164
165
166
167
168
169
170
171
172
173
174
175
176
177
178
179
180
181
182
183
184
185
186
187
188
189
190
191
192
193
194
195
196
197
198
199
200
201
202
203
204
205
206
207
208
209
210
211
212
213
214
215
216
217
218
219
220
221
222
223
224
225
226
227
228
229
230
231
232
233
234
235
236
237
238
239
240
241
242
243
244
245
246
247
248
249
250
251
252
253
254
255
256
257
258
259
260
261
262
263
264
265
266
267
268
269
270
271
272
273
274
275
276
277
278
279
280
281
282
283
284
285
286
287
288
289
290
291
292
293
294
295
296
297
298
299
300
301
302
303
304
305
306
307
308
309
310
311
312
313
314
315
316
317
318
319
320
321
322
323
324
325
326
327
328
329
330
331
332
333
334
335
336
337
338
339
340
341
342
343
344
345
346
347
348
349
350
351
352
353
354
355
356
357
358
359
360
361
362
363
364
365
366
367
368
369
370
371
372
373
374
375
376
377
378
379
380
381
382
383
384
385
386
387
388
389
390
391
392
393
394
395
396
397
398
399
400
401
402
403
404
This file contains any messages produced by compilers while
running configure, to aid debugging if configure makes a mistake.

It was created by configure, which was
generated by GNU Autoconf 2.69.  Invocation command line was

  $ ./configure 

## --------- ##
## Platform. ##
## --------- ##

hostname = stravinsky
uname -m = x86_64
uname -r = 4.1.13-100.fc21.x86_64
uname -s = Linux
uname -v = #1 SMP Tue Nov 10 13:13:20 UTC 2015

/usr/bin/uname -p = x86_64
/bin/uname -X     = unknown

/bin/arch              = x86_64
/usr/bin/arch -k       = unknown
/usr/convex/getsysinfo = unknown
/usr/bin/hostinfo      = unknown
/bin/machine           = unknown
/usr/bin/oslevel       = unknown
/bin/universe          = unknown

PATH: .
PATH: /bin
PATH: /sbin
PATH: /usr/bin
PATH: /usr/sbin
PATH: /usr/local/bin


## ----------- ##
## Core tests. ##
## ----------- ##

configure:2031: checking build system type
configure:2045: result: x86_64-unknown-linux-gnu
configure:2065: checking host system type
configure:2078: result: x86_64-unknown-linux-gnu
configure:2166: checking for gcc
configure:2182: found /bin/gcc
configure:2193: result: gcc
configure:2422: checking for C compiler version
configure:2431: gcc --version >&5
gcc (GCC) 4.9.2 20150212 (Red Hat 4.9.2-6)
Copyright (C) 2014 Free Software Foundation, Inc.
This is free software; see the source for copying conditions.  There is NO
warranty; not even for MERCHANTABILITY or FITNESS FOR A PARTICULAR PURPOSE.

configure:2442: $? = 0
configure:2431: gcc -v >&5
Using built-in specs.
COLLECT_GCC=gcc
COLLECT_LTO_WRAPPER=/usr/libexec/gcc/x86_64-redhat-linux/4.9.2/lto-wrapper
Target: x86_64-redhat-linux
Configured with: ../configure --prefix=/usr --mandir=/usr/share/man --infodir=/usr/share/info --with-bugurl=http://bugzilla.redhat.com/bugzilla --enable-bootstrap --enable-shared --enable-threads=posix --enable-checking=release --enable-multilib --with-system-zlib --enable-__cxa_atexit --disable-libunwind-exceptions --enable-gnu-unique-object --enable-linker-build-id --with-linker-hash-style=gnu --enable-languages=c,c++,objc,obj-c++,fortran,ada,go,lto --enable-plugin --enable-initfini-array --disable-libgcj --with-isl=/builddir/build/BUILD/gcc-4.9.2-20150212/obj-x86_64-redhat-linux/isl-install --with-cloog=/builddir/build/BUILD/gcc-4.9.2-20150212/obj-x86_64-redhat-linux/cloog-install --enable-gnu-indirect-function --with-tune=generic --with-arch_32=i686 --build=x86_64-redhat-linux
Thread model: posix
gcc version 4.9.2 20150212 (Red Hat 4.9.2-6) (GCC) 
configure:2442: $? = 0
configure:2431: gcc -V >&5
gcc: error: unrecognized command line option '-V'
gcc: fatal error: no input files
compilation terminated.
configure:2442: $? = 4
configure:2431: gcc -qversion >&5
gcc: error: unrecognized command line option '-qversion'
gcc: fatal error: no input files
compilation terminated.
configure:2442: $? = 4
configure:2462: checking whether the C compiler works
configure:2484: gcc    conftest.c  >&5
configure:2488: $? = 0
configure:2536: result: yes
configure:2539: checking for C compiler default output file name
configure:2541: result: a.out
configure:2547: checking for suffix of executables
configure:2554: gcc -o conftest    conftest.c  >&5
configure:2558: $? = 0
configure:2580: result: 
configure:2602: checking whether we are cross compiling
configure:2610: gcc -o conftest    conftest.c  >&5
configure:2614: $? = 0
configure:2621: ./conftest
configure:2625: $? = 0
configure:2640: result: no
configure:2645: checking for suffix of object files
configure:2667: gcc -c   conftest.c >&5
configure:2671: $? = 0
configure:2692: result: o
configure:2696: checking whether we are using the GNU C compiler
configure:2715: gcc -c   conftest.c >&5
configure:2715: $? = 0
configure:2724: result: yes
configure:2733: checking whether gcc accepts -g
configure:2753: gcc -c -g  conftest.c >&5
configure:2753: $? = 0
configure:2794: result: yes
configure:2811: checking for gcc option to accept ISO C89
configure:2874: gcc  -c -g -O2  conftest.c >&5
configure:2874: $? = 0
configure:2887: result: none needed
configure:2912: checking how to run the C preprocessor
configure:2943: gcc -E  conftest.c
configure:2943: $? = 0
configure:2957: gcc -E  conftest.c
conftest.c:9:28: fatal error: ac_nonexistent.h: No such file or directory
 #include <ac_nonexistent.h>
                            ^
compilation terminated.
configure:2957: $? = 1
configure: failed program was:
| /* confdefs.h */
| #define PACKAGE_NAME ""
| #define PACKAGE_TARNAME ""
| #define PACKAGE_VERSION ""
| #define PACKAGE_STRING ""
| #define PACKAGE_BUGREPORT ""
| #define PACKAGE_URL ""
| /* end confdefs.h.  */
| #include <ac_nonexistent.h>
configure:2982: result: gcc -E
configure:3002: gcc -E  conftest.c
configure:3002: $? = 0
configure:3016: gcc -E  conftest.c
conftest.c:9:28: fatal error: ac_nonexistent.h: No such file or directory
 #include <ac_nonexistent.h>
                            ^
compilation terminated.
configure:3016: $? = 1
configure: failed program was:
| /* confdefs.h */
| #define PACKAGE_NAME ""
| #define PACKAGE_TARNAME ""
| #define PACKAGE_VERSION ""
| #define PACKAGE_STRING ""
| #define PACKAGE_BUGREPORT ""
| #define PACKAGE_URL ""
| /* end confdefs.h.  */
| #include <ac_nonexistent.h>
configure:3045: checking for library containing strerror
configure:3076: gcc -o conftest -g -O2   conftest.c  >&5
configure:3076: $? = 0
configure:3093: result: none required
configure:3118: checking for a BSD-compatible install
configure:3186: result: /bin/install -c
configure:3240: checking for ranlib
configure:3256: found /bin/ranlib
configure:3267: result: ranlib
configure:3291: checking for autoconf
configure:3307: found /bin/autoconf
configure:3319: result: autoconf
configure:3329: checking for cp
configure:3345: found /bin/cp
configure:3357: result: cp
configure:3367: checking for rm
configure:3383: found /bin/rm
configure:3395: result: rm
configure:3405: checking for python3
configure:3421: found /bin/python3
configure:3433: result: yes
configure:3449: checking for grep that handles long lines and -e
configure:3507: result: /bin/grep
configure:3512: checking for egrep
configure:3574: result: /bin/grep -E
configure:3579: checking for ANSI C header files
configure:3599: gcc -c -g -O2  conftest.c >&5
configure:3599: $? = 0
configure:3672: gcc -o conftest -g -O2   conftest.c  >&5
configure:3672: $? = 0
configure:3672: ./conftest
configure:3672: $? = 0
configure:3683: result: yes
configure:3694: checking for setenv
configure:3694: gcc -o conftest -g -O2   conftest.c  >&5
configure:3694: $? = 0
configure:3694: result: yes
configure:3694: checking for putenv
configure:3694: gcc -o conftest -g -O2   conftest.c  >&5
configure:3694: $? = 0
configure:3694: result: yes
configure:3706: checking for env
configure:3724: found /bin/env
configure:3737: result: /bin/env
configure:3808: checking for tclsh
configure:3826: found /bin/tclsh
configure:3839: result: /bin/tclsh
configure:3912: checking for magic
configure:3930: found /usr/local/bin/magic
configure:3942: result: /usr/local/bin/magic
configure:4015: checking for netgen
configure:4033: found /usr/local/bin/netgen
configure:4045: result: /usr/local/bin/netgen
configure:4118: checking for qrouter
configure:4136: found /usr/local/bin/qrouter
configure:4148: result: /usr/local/bin/qrouter
configure:4221: checking for graywolf
configure:4239: found /usr/local/bin/graywolf
configure:4251: result: /usr/local/bin/graywolf
configure:4324: checking for yosys
configure:4342: found /usr/local/bin/yosys
configure:4354: result: /usr/local/bin/yosys
configure:4427: checking for ot-shell
configure:4460: result: no
configure:4529: checking for sta
configure:4547: found /usr/local/bin/sta
configure:4559: result: /usr/local/bin/sta
configure:4809: creating ./config.status

## ---------------------- ##
## Running config.status. ##
## ---------------------- ##

This file was extended by config.status, which was
generated by GNU Autoconf 2.69.  Invocation command line was

  CONFIG_FILES    = 
  CONFIG_HEADERS  = 
  CONFIG_LINKS    = 
  CONFIG_COMMANDS = 
  $ ./config.status 

on stravinsky

config.status:768: creating Makefile
config.status:768: creating scripts/Makefile
config.status:768: creating src/Makefile
config.status:768: creating tech/Makefile
config.status:768: creating tech/osu050/Makefile
config.status:768: creating tech/osu035/Makefile
config.status:768: creating tech/osu018/Makefile
config.status:768: creating tech/gscl45nm/Makefile

## ---------------- ##
## Cache variables. ##
## ---------------- ##

ac_cv_build=x86_64-unknown-linux-gnu
ac_cv_c_compiler_gnu=yes
ac_cv_env_CC_set=
ac_cv_env_CC_value=
ac_cv_env_CFLAGS_set=
ac_cv_env_CFLAGS_value=
ac_cv_env_CPPFLAGS_set=
ac_cv_env_CPPFLAGS_value=
ac_cv_env_CPP_set=
ac_cv_env_CPP_value=
ac_cv_env_LDFLAGS_set=
ac_cv_env_LDFLAGS_value=
ac_cv_env_LIBS_set=
ac_cv_env_LIBS_value=
ac_cv_env_build_alias_set=
ac_cv_env_build_alias_value=
ac_cv_env_host_alias_set=
ac_cv_env_host_alias_value=
ac_cv_env_target_alias_set=
ac_cv_env_target_alias_value=
ac_cv_func_putenv=yes
ac_cv_func_setenv=yes
ac_cv_header_stdc=yes
ac_cv_host=x86_64-unknown-linux-gnu
ac_cv_objext=o
ac_cv_path_EGREP='/bin/grep -E'
ac_cv_path_ENV_PATH=/bin/env
ac_cv_path_GREP=/bin/grep
ac_cv_path_QFLOW_GRAYWOLF_PATH=/usr/local/bin/graywolf
ac_cv_path_QFLOW_MAGIC_PATH=/usr/local/bin/magic
ac_cv_path_QFLOW_NETGEN_PATH=/usr/local/bin/netgen
ac_cv_path_QFLOW_OPENSTA_PATH=/usr/local/bin/sta
ac_cv_path_QFLOW_QROUTER_PATH=/usr/local/bin/qrouter
ac_cv_path_QFLOW_YOSYS_PATH=/usr/local/bin/yosys
ac_cv_path_TCLSH_PATH=/bin/tclsh
ac_cv_path_install='/bin/install -c'
ac_cv_prog_AUTOCONF=autoconf
ac_cv_prog_CP=cp
ac_cv_prog_CPP='gcc -E'
ac_cv_prog_HAVE_PYTHON3=yes
ac_cv_prog_RM=rm
ac_cv_prog_ac_ct_CC=gcc
ac_cv_prog_ac_ct_RANLIB=ranlib
ac_cv_prog_cc_c89=
ac_cv_prog_cc_g=yes
ac_cv_search_strerror='none required'

## ----------------- ##
## Output variables. ##
## ----------------- ##

AUTOCONF='autoconf'
CC='gcc'
CFLAGS='-g -O2'
CP='cp'
CPP='gcc -E'
CPPFLAGS=''
DEFS='-DPACKAGE_NAME=\"\" -DPACKAGE_TARNAME=\"\" -DPACKAGE_VERSION=\"\" -DPACKAGE_STRING=\"\" -DPACKAGE_BUGREPORT=\"\" -DPACKAGE_URL=\"\" -DSTDC_HEADERS=1 -DHAVE_SETENV=1 -DHAVE_PUTENV=1 -DTCLSH_PATH=\"/bin/tclsh\" -DQFLOW_MAGIC_PATH=\"/usr/local/bin/magic\" -DQFLOW_NETGEN_PATH=\"/usr/local/bin/netgen\" -DQFLOW_QROUTER_PATH=\"/usr/local/bin/qrouter\" -DQFLOW_GRAYWOLF_PATH=\"/usr/local/bin/graywolf\" -DQFLOW_YOSYS_PATH=\"/usr/local/bin/yosys\" -DQFLOW_OPENTIMER_PATH=\"\" -DQFLOW_OPENSTA_PATH=\"/usr/local/bin/sta\"'
ECHO_C=''
ECHO_N='-n'
ECHO_T=''
EGREP='/bin/grep -E'
ENV_PATH='/bin/env'
EXEEXT=''
GREP='/bin/grep'
HAVE_MAGIC='1'
HAVE_NETGEN='1'
HAVE_OPENSTA='1'
HAVE_OPENTIMER='0'
HAVE_PYTHON3='yes'
HAVE_YOSYS='1'
INSTALL_DATA='${INSTALL} -m 644'
INSTALL_PROGRAM='${INSTALL}'
INSTALL_SCRIPT='${INSTALL}'
LD=''
LDFLAGS=''
LIBOBJS=''
LIBS=''
LTLIBOBJS=''
OBJEXT='o'
PACKAGE_BUGREPORT=''
PACKAGE_NAME=''
PACKAGE_STRING=''
PACKAGE_TARNAME=''
PACKAGE_URL=''
PACKAGE_VERSION=''
PATH_SEPARATOR=':'
QFLOW_BIN_DIR='/usr/local/bin'
QFLOW_GRAYWOLF_PATH='/usr/local/bin/graywolf'
QFLOW_LIB_DIR='/usr/local/share/qflow'
QFLOW_MAGIC_PATH='/usr/local/bin/magic'
QFLOW_NETGEN_PATH='/usr/local/bin/netgen'
QFLOW_OPENSTA_PATH='/usr/local/bin/sta'
QFLOW_OPENTIMER_PATH=''
QFLOW_QROUTER_PATH='/usr/local/bin/qrouter'
QFLOW_YOSYS_PATH='/usr/local/bin/yosys'
RANLIB='ranlib'
REVISION='11'
RM='rm'
SHELL='/bin/sh'
STDLIBS=''
TCLSH_PATH='/bin/tclsh'
VERSION='1.3'
ac_ct_CC='gcc'
bindir='${exec_prefix}/bin'
build='x86_64-unknown-linux-gnu'
build_alias=''
build_cpu='x86_64'
build_os='linux-gnu'
build_vendor='unknown'
datadir='${datarootdir}'
datarootdir='${prefix}/share'
docdir='${datarootdir}/doc/${PACKAGE}'
dvidir='${docdir}'
exec_prefix='${prefix}'
host='x86_64-unknown-linux-gnu'
host_alias=''
host_cpu='x86_64'
host_os='linux-gnu'
host_vendor='unknown'
htmldir='${docdir}'
includedir='${prefix}/include'
infodir='${datarootdir}/info'
libdir='${exec_prefix}/lib'
libexecdir='${exec_prefix}/libexec'
localedir='${datarootdir}/locale'
localstatedir='${prefix}/var'
mandir='${datarootdir}/man'
oldincludedir='/usr/include'
pdfdir='${docdir}'
prefix='/usr/local'
program_transform_name='s,x,x,'
psdir='${docdir}'
sbindir='${exec_prefix}/sbin'
sharedstatedir='${prefix}/com'
sysconfdir='${prefix}/etc'
target_alias=''

## ----------- ##
## confdefs.h. ##
## ----------- ##

/* confdefs.h */
#define PACKAGE_NAME ""
#define PACKAGE_TARNAME ""
#define PACKAGE_VERSION ""
#define PACKAGE_STRING ""
#define PACKAGE_BUGREPORT ""
#define PACKAGE_URL ""
#define STDC_HEADERS 1
#define HAVE_SETENV 1
#define HAVE_PUTENV 1
#define TCLSH_PATH "/bin/tclsh"
#define QFLOW_MAGIC_PATH "/usr/local/bin/magic"
#define QFLOW_NETGEN_PATH "/usr/local/bin/netgen"
#define QFLOW_QROUTER_PATH "/usr/local/bin/qrouter"
#define QFLOW_GRAYWOLF_PATH "/usr/local/bin/graywolf"
#define QFLOW_YOSYS_PATH "/usr/local/bin/yosys"
#define QFLOW_OPENTIMER_PATH ""
#define QFLOW_OPENSTA_PATH "/usr/local/bin/sta"

configure: exit 0