File: qgis-test-travis.ctest

package info (click to toggle)
qgis 2.18.28+dfsg-2
  • links: PTS, VCS
  • area: main
  • in suites: buster
  • size: 1,007,948 kB
  • sloc: cpp: 671,774; python: 158,539; xml: 35,690; ansic: 8,346; sh: 1,766; perl: 1,669; sql: 999; yacc: 836; lex: 461; makefile: 292
file content (100 lines) | stat: -rw-r--r-- 3,953 bytes parent folder | download | duplicates (2)
1
2
3
4
5
6
7
8
9
10
11
12
13
14
15
16
17
18
19
20
21
22
23
24
25
26
27
28
29
30
31
32
33
34
35
36
37
38
39
40
41
42
43
44
45
46
47
48
49
50
51
52
53
54
55
56
57
58
59
60
61
62
63
64
65
66
67
68
69
70
71
72
73
74
75
76
77
78
79
80
81
82
83
84
85
86
87
88
89
90
91
92
93
94
95
96
97
98
99
100
SET (CTEST_SOURCE_DIRECTORY $ENV{TRAVIS_BUILD_DIR})
SET (CTEST_BINARY_DIRECTORY "$ENV{TRAVIS_BUILD_DIR}/build")
#SET (CTEST_SOURCE_DIRECTORY /usr/src/QGIS)
#SET (CTEST_BINARY_DIRECTORY /usr/src/qgis-build)

SET (CTEST_CMAKE_GENERATOR  "Unix Makefiles")
SET (CTEST_CMAKE_COMMAND "cmake")
SET (CTEST_BUILD_COMMAND "/usr/bin/make -j2 -i -k")
SET (CTEST_SITE "travis-ci.org")
IF ($ENV{TRAVIS_PULL_REQUEST} STREQUAL "false")
  # No pull request
  SET (CTEST_BUILD_NAME "$ENV{TRAVIS_BRANCH} ($ENV{BUILD}) ($ENV{TRAVIS_COMMIT})")
ELSE()
  SET (CTEST_BUILD_NAME "PR: $ENV{TRAVIS_PULL_REQUEST} / $ENV{TRAVIS_BRANCH} ($ENV{BUILD}) ($ENV{TRAVIS_COMMIT})")
ENDIF()
SET (CTEST_BUILD_CONFIGURATION "Release")
SET (CTEST_TEST_TIMEOUT 60) # 60 seconds
IF(DEFINED ENV{CTEST_PARALLEL_LEVEL})
  SET(PARALLEL_LEVEL $ENV{CTEST_PARALLEL_LEVEL})
ELSE(DEFINED ENV{CTEST_PARALLEL_LEVEL})
  SET(PARALLEL_LEVEL 2)
ENDIF(DEFINED ENV{CTEST_PARALLEL_LEVEL})

SET (INITIAL_CACHE "
  BUILDNAME:STRING=${CTEST_BUILD_NAME}
  SITE:STRING=${CTEST_SITE}
  CTEST_USE_LAUNCHERS:BOOL=ON
")

SET (CTEST_NOTES_FILES
  ${CTEST_SCRIPT_DIRECTORY}/${CTEST_SCRIPT_NAME}
  ${CTEST_BINARY_DIRECTORY}/CMakeCache.txt
)

IF(NOT WIN32)
  STRING(ASCII 27 Esc)
  SET(ColorReset  "${Esc}[m")
  SET(ColorBold   "${Esc}[1m")
  SET(Red         "${Esc}[31m")
  SET(Green       "${Esc}[32m")
  SET(Yellow      "${Esc}[33m")
  SET(Blue        "${Esc}[34m")
  SET(Magenta     "${Esc}[35m")
  SET(Cyan        "${Esc}[36m")
  SET(White       "${Esc}[37m")
  SET(BoldRed     "${Esc}[1;31m")
  SET(BoldGreen   "${Esc}[1;32m")
  SET(BoldYellow  "${Esc}[1;33m")
  SET(BoldBlue    "${Esc}[1;34m")
  SET(BoldMagenta "${Esc}[1;35m")
  SET(BoldCyan    "${Esc}[1;36m")
  SET(BoldWhite   "${Esc}[1;37m")
ENDIF(NOT WIN32)

# Requires a track on the CDash server
#ctest_start(Experimental TRACK Travis)
ctest_start(Experimental)
ctest_build (BUILD "${CTEST_BINARY_DIRECTORY}" RETURN_VALUE BUILDRES NUMBER_WARNINGS NUMWARN NUMBER_ERRORS NUMERR)

# Create link to test results
# CDash on OTB requires the date to be set for the search to work and that's the timezone this requires
SET(ENV{TZ} "UTC-6")
EXECUTE_PROCESS(COMMAND date +%Y-%m-%d OUTPUT_VARIABLE CDASH_DATE)
SET(RESULT_LINK "http://dash.orfeo-toolbox.org/index.php?project=QGIS&filtercount=1&showfilters=1&field1=buildname/string&compare1=63&value1=$ENV{TRAVIS_COMMIT}&date=${CDASH_DATE}")
EXECUTE_PROCESS(COMMAND curl --data-urlencode "url=${RESULT_LINK}" -s http://tinyurl.com/api-create.php
                OUTPUT_VARIABLE SHORTURL)

SET(IGNORE_BUILD_FAILURES $ENV{IGNORE_BUILD_FAILURES})
IF(NOT IGNORE_BUILD_FAILURES)
  IF(NOT ${BUILDRES} EQUAL 0 OR NOT ${NUMERR} EQUAL 0)
    ctest_submit (RETRY_COUNT 3 RETRY_DELAY 30)
    MESSAGE("")
    MESSAGE("  ${Yellow}Test results submitted to${ColorReset}")
    MESSAGE("  ${BoldYellow}${SHORTURL}${ColorReset}")
    MESSAGE("")
    MESSAGE( FATAL_ERROR "  ${Red}Build failed. Not running tests.${ColorReset}" )
    MESSAGE("")
  ENDIF(NOT ${BUILDRES} EQUAL 0 OR NOT ${NUMERR} EQUAL 0)
ENDIF(NOT IGNORE_BUILD_FAILURES)
ctest_test (BUILD "${CTEST_BINARY_DIRECTORY}" PARALLEL_LEVEL ${PARALLEL_LEVEL} RETURN_VALUE TESTRES)
IF(NOT ${NUMWARN} EQUAL 0 OR NOT ${TESTRES} EQUAL 0)
  ctest_submit (RETRY_COUNT 3 RETRY_DELAY 30)
  MESSAGE("")
  MESSAGE("  ${Yellow}Test results submitted to${ColorReset}")
  MESSAGE("  ${BoldYellow}${SHORTURL}${ColorReset}" )
  MESSAGE("")
  MESSAGE( FATAL_ERROR "  ${Red}Build warnings found, aborting test.${ColorReset}" )
  IF(NOT ${TESTRES} EQUAL 0)
    SET(TESTRES_MESSAGE "  Tests failed.")
  ENDIF(NOT ${TESTRES} EQUAL 0)
  IF(NOT${NUMWARN} EQUAL 0)
    SET(WARNING_MESSAGE "  Build warnings found.")
  ENDIF(NOT ${NUMWARN} EQUAL 0)
  MESSAGE( FATAL_ERROR "  ${TESTRES_MESSAGE} ${WARNING_MESSAGE}" )
ENDIF(NOT ${NUMWARN} EQUAL 0 OR NOT ${TESTRES} EQUAL 0)

MESSAGE("")
MESSAGE("  ${BoldGreen}Success${ColorReset}")
MESSAGE("  ${Green}All tests passed successfully.${ColorReset}")
MESSAGE("")