File: test-thread-capture.run.stdout

package info (click to toggle)
rustc 1.85.0%2Bdfsg2-3
  • links: PTS, VCS
  • area: main
  • in suites: forky, sid, trixie
  • size: 893,176 kB
  • sloc: xml: 158,127; python: 35,830; javascript: 19,497; cpp: 19,002; sh: 17,245; ansic: 13,127; asm: 4,376; makefile: 1,051; lisp: 29; perl: 29; ruby: 19; sql: 11
file content (23 lines) | stat: -rw-r--r-- 420 bytes parent folder | download | duplicates (14)
1
2
3
4
5
6
7
8
9
10
11
12
13
14
15
16
17
18
19
20
21
22
23

running 2 tests
test thready_fail ... FAILED
test thready_pass ... ok

failures:

---- thready_fail stdout ----
fee
fie
foe
fum

thread 'thready_fail' panicked at $DIR/test-thread-capture.rs:32:5:
explicit panic
note: run with `RUST_BACKTRACE=1` environment variable to display a backtrace


failures:
    thready_fail

test result: FAILED. 1 passed; 1 failed; 0 ignored; 0 measured; 0 filtered out; finished in $TIME